Target
Complement factor D
Ligand
BDBM340306
Substrate
Meas. Tech.
Inhibition Assay
IC50
<1000±n/a nM
Citation
 Wiles, JAPhadke, ASWang, XChen, DHashimoto, AGadhachanda, VRPais, GWang, QAgarwal, ADeshpande, M Compounds for treatment of complement mediated disorders US Patent  US9758537 Publication Date 9/12/2017 
Target
Name:
Complement factor D
Synonyms:
Adipsin CFAD_HUMAN DF Properdin factor D
Type:
Protein
Mol. Mass.:
27039.19
Organism:
Homo sapiens (Human)
Description:
P00746
Residue:
253
  
Inhibitor
Name:
BDBM340306
Synonyms:
N-(1-(3-acetyl-1-(2- ((2S,4R)-2-(6- bromopyridin-2- ylcarbamoyl)-4- fluoropyrrolidin-1-yl)- 2-oxoethyl)-1H-indol-5- yl)cyclopropyl)pyrimidine- 2-carboxamide | US9758537, Compound 119
Type:
Small organic molecule
Emp. Form.:
C30H27BrFN7O4
Mol. Mass.:
648.482
SMILES:
CC(=O)c1cn(CC(=O)N2C[C@H](F)C[C@H]2C(=O)Nc2cccc(Br)n2)c2ccc(cc12)C1(CC1)NC(=O)c1ncccn1
: