Target
CREB-binding protein
Ligand
BDBM340472
Substrate
Meas. Tech.
TR-FRET Binding Assay
IC50
120±n/a nM
Citation
 Adler, MAlbrecht, BKBronner, SChen, KXCôté, ACrawford, TCyr, PEgen, JKauder, SLai, KWLiao, JMagnuson, SMurray, JPastor, RRomero, FATaylor, AMTsui, VHWang, FZhu, B Therapeutic compounds and uses thereof US Patent  US9763922 Publication Date 9/19/2017 
Target
Name:
CREB-binding protein
Synonyms:
CBP CREB-binding protein (CBP) CREBBP
Type:
Transcription Coactivator
Mol. Mass.:
265411.66
Organism:
Homo sapiens (Human)
Description:
Q92793
Residue:
2442
  
Inhibitor
Name:
BDBM340472
Synonyms:
US9763922, Example 3
Type:
Small organic molecule
Emp. Form.:
C19H21FN6O
Mol. Mass.:
368.408
SMILES:
CC(=O)N1CCc2c(C1)c(Nc1cccc(-c3cnn(C)c3)c1F)nn2C
: