Target
Apoptosis regulator Bcl-2
Ligand
BDBM341040
Substrate
Meas. Tech.
Fluorescence Polarisation Assay
IC50
3.30±n/a nM
Citation
 Casara, PLe Diguarher, THenlin, JStarck, JLe Tiran, ADe Nanteuil, GGeneste, ODavidson, JEMurray, JBChen, IWalmsley, CGraham, CJRay, SMaddox, DBedford, S Indole and pyrrole compounds, a process for their preparation and pharmaceutical compositions containing them US Patent  US9765056 Publication Date 9/19/2017 
Target
Name:
Apoptosis regulator Bcl-2
Synonyms:
Apoptosis regulator Bcl-2 Protein BCL-2 BCL2_HUMAN | Bcl-2 Protein
Type:
Homodimer or heterodimer
Mol. Mass.:
26269.11
Organism:
Homo sapiens (Human)
Description:
P10415
Residue:
239
  
Inhibitor
Name:
BDBM341040
Synonyms:
1-(5-Chloro-2-{[(3S)-3-[(4-methylpiperazin-1-yl)methyl]-3,4-dihydroisoquinolin-2(1H)-yl]carbonyl}phenyl)-N-(4-hydroxyphenyl)-N-(1-methyl-1H-indol-5-yl)-1H-indole-3-carboxamide | US9765056, Example 93
Type:
Small organic molecule
Emp. Form.:
C46H43ClN6O3
Mol. Mass.:
763.325
SMILES:
CN1CCN(C[C@@H]2Cc3ccccc3CN2C(=O)c2ccc(Cl)cc2-n2cc(C(=O)N(c3ccc(O)cc3)c3ccc4n(C)ccc4c3)c3ccccc23)CC1
: