Target
Apoptosis regulator Bcl-2
Ligand
BDBM341089
Substrate
Meas. Tech.
Fluorescence Polarisation Assay
IC50
218±n/a nM
Citation
 Casara, PLe Diguarher, THenlin, JStarck, JLe Tiran, ADe Nanteuil, GGeneste, ODavidson, JEMurray, JBChen, IWalmsley, CGraham, CJRay, SMaddox, DBedford, S Indole and pyrrole compounds, a process for their preparation and pharmaceutical compositions containing them US Patent  US9765056 Publication Date 9/19/2017 
Target
Name:
Apoptosis regulator Bcl-2
Synonyms:
Apoptosis regulator Bcl-2 Protein BCL-2 BCL2_HUMAN | Bcl-2 Protein
Type:
Homodimer or heterodimer
Mol. Mass.:
26269.11
Organism:
Homo sapiens (Human)
Description:
P10415
Residue:
239
  
Inhibitor
Name:
BDBM341089
Synonyms:
1-{4-Amino-2-[(3S)-3-(aminomethyl)-1,2,3,4-tetrahydroisoquinoline-2-carbonyl]-5-methoxyphenyl}-N,N-diphenyl-1H-indazole-3-carboxamide | US9765056, Example 152
Type:
Small organic molecule
Emp. Form.:
C38H34N6O3
Mol. Mass.:
622.715
SMILES:
COc1cc(c(cc1N)C(=O)N1Cc2ccccc2C[C@H]1CN)-n1nc(C(=O)N(c2ccccc2)c2ccccc2)c2ccccc12
: