Target
Fibroblast growth factor receptor 3
Ligand
BDBM339992
Substrate
Meas. Tech.
Inhibition Kinases In Vitro Assay
IC50
8.65±n/a nM
Citation
 Zdzalik, DLipner, JWieczorek, MDzwonek, KYamani, ADubiel, KLamparska-Przybysz, MGrygielewicz, PStanczak, A Pyrazolylbenzo[d]imidazole derivatives US Patent  US9776988 Publication Date 10/3/2017 
Target
Name:
Fibroblast growth factor receptor 3
Synonyms:
CD_antigen: CD333 FGFR3 Fibroblast growth factor receptor JTK4
Type:
Protein
Mol. Mass.:
87699.57
Organism:
Homo sapiens (Human)
Description:
P22607
Residue:
806
  
Inhibitor
Name:
BDBM339992
Synonyms:
US9776988, Example 18
Type:
Small organic molecule
Emp. Form.:
C26H32N6O2
Mol. Mass.:
460.5713
SMILES:
CCN1CCN(CC1)c1ccc2[nH]c(nc2c1)-c1cc(CCc2cc(OC)cc(OC)c2)[nH]n1
: