Target
High affinity nerve growth factor receptor
Ligand
BDBM344167
Substrate
IC50
195±n/a nM
Citation
 Altenbach, RJLiu, HClapham, BAguirre, ALCowart, MKoenig, JRSarris, KScanio, MJSwinger, KKVasudevan, AVillamil, CIWoller, KR Furo-3-carboxamide derivatives and methods of use US Patent  US9777020 Publication Date 10/3/2017 
Target
Name:
High affinity nerve growth factor receptor
Synonyms:
2.7.10.1 NTRK1 NTRK1_HUMAN Neurotrophic tyrosine kinase receptor type 1 Synonyms=MTC TRK1-transforming tyrosine kinase protein TRKA GN Trk-A Tropomyosin-related kinase A Tyrosine kinase receptor Tyrosine kinase receptor A Tyrosine kinase receptor A (Trk-A) gp140trk | p140-TrkA
Type:
Mol. Mass.:
87498.18
Organism:
Homo sapiens (Human)
Description:
P04629
Residue:
796
  
Inhibitor
Name:
BDBM344167
Synonyms:
5-methyl-4-oxo-N-[4-(piperidin-1-yl)phenyl]-4,5,6,7-tetrahydrofuro[3,2-c]pyridine-3-carboxamide | US9777020, Example 61
Type:
Small organic molecule
Emp. Form.:
C20H23N3O3
Mol. Mass.:
353.4149
SMILES:
CN1CCc2occ(C(=O)Nc3ccc(cc3)N3CCCCC3)c2C1=O
: