Target
Histone deacetylase 4
Ligand
BDBM344315
Substrate
Meas. Tech.
Inhibition Assay
IC50
2500±n/a nM
Citation
 Dominguez, CMuñoz-Sanjuán, IMaillard, MRaphy, GHaughan, AFLuckhurst, CAJarvis, REBürli, RWBreccia, PWishart, GHughes, SJAllen, DRPenrose, SD Histone deacetylase inhibitors and compositions and methods of use thereof US Patent  US9783488 Publication Date 10/10/2017 
Target
Name:
Histone deacetylase 4
Synonyms:
Cereblon/Histone deacetylase 4 HDAC4 Histone acetylase 4(HDAC4) KIAA0288
Type:
Enzyme
Mol. Mass.:
119049.39
Organism:
Homo sapiens (Human)
Description:
P56524
Residue:
1084
  
Inhibitor
Name:
BDBM344315
Synonyms:
1-(2-Chloro-6-fluorophenyl)-N- hydroxycyclopentanecarboxamide | US9783488, Example 22
Type:
Small organic molecule
Emp. Form.:
C12H13ClFNO2
Mol. Mass.:
257.689
SMILES:
ONC(=O)C1(CCCC1)c1c(F)cccc1Cl
: