Target
Histone deacetylase 4
Ligand
BDBM344327
Substrate
Meas. Tech.
Inhibition Assay
IC50
910±n/a nM
Citation
 Dominguez, CMuñoz-Sanjuán, IMaillard, MRaphy, GHaughan, AFLuckhurst, CAJarvis, REBürli, RWBreccia, PWishart, GHughes, SJAllen, DRPenrose, SD Histone deacetylase inhibitors and compositions and methods of use thereof US Patent  US9783488 Publication Date 10/10/2017 
Target
Name:
Histone deacetylase 4
Synonyms:
Cereblon/Histone deacetylase 4 HDAC4 Histone acetylase 4(HDAC4) KIAA0288
Type:
Enzyme
Mol. Mass.:
119049.39
Organism:
Homo sapiens (Human)
Description:
P56524
Residue:
1084
  
Inhibitor
Name:
BDBM344327
Synonyms:
1-(2-Chloro-6-methylphenyl)-N- hydroxycyclopentanecarboxamide | US9783488, Example 31
Type:
Small organic molecule
Emp. Form.:
C13H16ClNO2
Mol. Mass.:
253.725
SMILES:
Cc1cccc(Cl)c1C1(CCCC1)C(=O)NO
: