Target
Histone deacetylase 4
Ligand
BDBM344362
Substrate
Meas. Tech.
Inhibition Assay
IC50
200±n/a nM
Citation
 Dominguez, CMuñoz-Sanjuán, IMaillard, MRaphy, GHaughan, AFLuckhurst, CAJarvis, REBürli, RWBreccia, PWishart, GHughes, SJAllen, DRPenrose, SD Histone deacetylase inhibitors and compositions and methods of use thereof US Patent  US9783488 Publication Date 10/10/2017 
Target
Name:
Histone deacetylase 4
Synonyms:
Cereblon/Histone deacetylase 4 HDAC4 Histone acetylase 4(HDAC4) KIAA0288
Type:
Enzyme
Mol. Mass.:
119049.39
Organism:
Homo sapiens (Human)
Description:
P56524
Residue:
1084
  
Inhibitor
Name:
BDBM344362
Synonyms:
N-((R)-1- (Dipropylamino)propan-2- yl)-4-((1R*,3S)-3-(3- fluoro-2-methylphenyl)-3- (hydroxycarbamoyl) cyclopentyl)benzamide | US9783488, Example 52
Type:
Small organic molecule
Emp. Form.:
C29H40FN3O3
Mol. Mass.:
497.6446
SMILES:
CCCN(CCC)C[C@@H](C)NC(=O)c1ccc(cc1)[C@@H]1CC[C@@](C1)(C(=O)NO)c1cccc(F)c1C
: