Target
Nuclear receptor ROR-gamma
Ligand
BDBM344435
Substrate
Meas. Tech.
Biochemical TR-FRET Assay
IC50
7.00±n/a nM
Citation
 Aicher, TDVanHuis, CAMacLean, JAndresen, BMBarr, KJBienstock, CDaniels, MLiu, KLiu, YWhite, CSciammetta, NSimov, V Carbamate benzoxazine propionic acids and acid derivatives for modulation of RORgamma activity and the treatment of disease US Patent  US9783511 Publication Date 10/10/2017 
Target
Name:
Nuclear receptor ROR-gamma
Synonyms:
NR1F3 Nuclear receptor ROR-gamma (RORC) RAR-related orphan receptor C (RORc) RORG RZRG Retinoid-related orphan receptor-gamma (RORc)
Type:
Enzyme Catalytic Domain
Mol. Mass.:
58218.40
Organism:
Homo sapiens (Human)
Description:
P51449
Residue:
518
  
Inhibitor
Name:
BDBM344435
Synonyms:
(R or S)-ethyl 3-((S)-4-((3-chloro- 1-ethyl-1H-pyrazol-4- yl)sulfonyl)-6-((((1,1,1-trifluoro- 2-methylpropan-2- yl)oxy)carbonyl)amino)-3,4- dihydro-2H-benzo[b][1,4]oxazin- 2-yl)-2-methylpropanoate | US9783511, 3F
Type:
Small organic molecule
Emp. Form.:
C24H30ClF3N4O7S
Mol. Mass.:
611.031
SMILES:
CCOC(=O)[C@@H](C)C[C@H]1CN(c2cc(NC(=O)OC(C)(C)C(F)(F)F)ccc2O1)S(=O)(=O)c1cn(CC)nc1Cl
: