Target
Lysine-specific demethylase 2B
Ligand
BDBM345358
Substrate
Meas. Tech.
KDM2B TR-FRET Assay
IC50
0.275±n/a nM
Citation
 Albrecht, BKCote, AGehling, VHsiao-Wei Tsui, VKiefer, JRLiang, JMagnuson, SNasveschuk, CGRomero, FATaylor, AM Therapeutic compounds and uses thereof US Patent  US10202354 Publication Date 2/12/2019 
Target
Name:
Lysine-specific demethylase 2B
Synonyms:
AA 1-650 FBL10 Homo sapiens lysine demethylase 2B (KDM2B) KDM2B Lysine-specific demethylase 2B NDY1 PCCX2
Type:
Enzyme Catalytic Domain
Mol. Mass.:
152658.35
Organism:
Homo sapiens (Human)
Description:
Q8NHM5
Residue:
1336
  
Inhibitor
Name:
BDBM345358
Synonyms:
1-[1-[4-(4-chlorophenyl)phe-nyl]sulfonyl-4,5-dihydroimidazol-2-yl]-4-cyclobutyl-piperazine | US10202354, Example 23
Type:
Small organic molecule
Emp. Form.:
C23H27ClN4O2S
Mol. Mass.:
459.004
SMILES:
Clc1ccc(cc1)-c1ccc(cc1)S(=O)(=O)N1CCN=C1N1CCN(CC1)C1CCC1
: