Target
Lysine-specific demethylase 2B
Ligand
BDBM345383
Substrate
Meas. Tech.
KDM2B TR-FRET Assay
IC50
1.19±n/a nM
Citation
 Albrecht, BKCote, AGehling, VHsiao-Wei Tsui, VKiefer, JRLiang, JMagnuson, SNasveschuk, CGRomero, FATaylor, AM Therapeutic compounds and uses thereof US Patent  US10202354 Publication Date 2/12/2019 
Target
Name:
Lysine-specific demethylase 2B
Synonyms:
AA 1-650 FBL10 Homo sapiens lysine demethylase 2B (KDM2B) KDM2B Lysine-specific demethylase 2B NDY1 PCCX2
Type:
Enzyme Catalytic Domain
Mol. Mass.:
152658.35
Organism:
Homo sapiens (Human)
Description:
Q8NHM5
Residue:
1336
  
Inhibitor
Name:
BDBM345383
Synonyms:
3-cyclobutyl-8-[1-(4-isopropylphenyl)sulfonyl-4,5-dihydroimidazol-2-yl]-3,8-diazabicyclo[3.2.1]octane | US10202354, Example 48
Type:
Small organic molecule
Emp. Form.:
C22H32N4O2S
Mol. Mass.:
416.58
SMILES:
CC(C)c1ccc(cc1)S(=O)(=O)N1CCN=C1N1C2CCC1CN(C2)C1CCC1
: