Target
Lysine-specific demethylase 2B
Ligand
BDBM345401
Substrate
Meas. Tech.
KDM2B TR-FRET Assay
IC50
0.141±n/a nM
Citation
 Albrecht, BKCote, AGehling, VHsiao-Wei Tsui, VKiefer, JRLiang, JMagnuson, SNasveschuk, CGRomero, FATaylor, AM Therapeutic compounds and uses thereof US Patent  US10202354 Publication Date 2/12/2019 
Target
Name:
Lysine-specific demethylase 2B
Synonyms:
AA 1-650 FBL10 Homo sapiens lysine demethylase 2B (KDM2B) KDM2B Lysine-specific demethylase 2B NDY1 PCCX2
Type:
Enzyme Catalytic Domain
Mol. Mass.:
152658.35
Organism:
Homo sapiens (Human)
Description:
Q8NHM5
Residue:
1336
  
Inhibitor
Name:
BDBM345401
Synonyms:
4-[[2-(4-cyclobutylpiperazin-1-yl)-4,5-dihydroimidazol-1-yl]sulfonyl]-2,1,3-benzothiadiazole | US10202354, Example 66
Type:
Small organic molecule
Emp. Form.:
C17H22N6O2S2
Mol. Mass.:
406.526
SMILES:
O=S(=O)(N1CCN=C1N1CCN(CC1)C1CCC1)c1cccc2nsnc12
: