Target
CREB-binding protein
Ligand
BDBM345509
Substrate
Meas. Tech.
In Vitro Enzyme Inhibition Assay-CREBBP Inhibition
IC50
2750±n/a nM
Citation
 Bennett, MJBetancort, JMBoloor, AKanouni, TStafford, JAVeal, JMWallace, MB Therapeutic compounds US Patent  US10202360 Publication Date 2/12/2019 
Target
Name:
CREB-binding protein
Synonyms:
CBP CREB-binding protein (CBP) CREBBP
Type:
Transcription Coactivator
Mol. Mass.:
265411.66
Organism:
Homo sapiens (Human)
Description:
Q92793
Residue:
2442
  
Inhibitor
Name:
BDBM345509
Synonyms:
Propane-1-sulfonic acid [6-(1- cyclopropyl-5-methyl-6-oxo-1,6- dihydro-pyridin-3-yl)-2-(2,6- dimethyl-phenoxy)-pyrimidin-4-yl]- amide | US10202360, Example 54
Type:
Small organic molecule
Emp. Form.:
C24H28N4O4S
Mol. Mass.:
468.569
SMILES:
CCCS(=O)(=O)Nc1cc(nc(Oc2c(C)cccc2C)n1)-c1cc(C)c(=O)n(c1)C1CC1
: