Target
CREB-binding protein
Ligand
BDBM345563
Substrate
Meas. Tech.
In Vitro Enzyme Inhibition Assay-CREBBP Inhibition
IC50
<500±n/a nM
Citation
 Bennett, MJBetancort, JMBoloor, AKanouni, TStafford, JAVeal, JMWallace, MB Therapeutic compounds US Patent  US10202360 Publication Date 2/12/2019 
Target
Name:
CREB-binding protein
Synonyms:
CBP CREB-binding protein (CBP) CREBBP
Type:
Transcription Coactivator
Mol. Mass.:
265411.66
Organism:
Homo sapiens (Human)
Description:
Q92793
Residue:
2442
  
Inhibitor
Name:
BDBM345563
Synonyms:
Butane-1-sulfonic acid [2-(2-cyano- 6-methyl-phenoxy)-6-(1-methyl-6- oxo-1,6-dihydro-pyridin-3-yl)- pyrimidin-4-yl]-amide | US10202360, Example 108
Type:
Small organic molecule
Emp. Form.:
C22H23N5O4S
Mol. Mass.:
453.514
SMILES:
CCCCS(=O)(=O)Nc1cc(nc(Oc2c(C)cccc2C#N)n1)-c1ccc(=O)n(C)c1
: