Target
CREB-binding protein
Ligand
BDBM349473
Substrate
Meas. Tech.
CBP TR-FRET Binding Assay
IC50
100.0±n/a nM
Citation
 Romero, FAMagnuson, SRPastor, RTsui, VHMurray, JCrawford, TBurdick, DJAlbrecht, BKCote, ATaylor, AMNasveschuck, CGLeBlanc, YHewitt, MCLai, KWChen, K Therapeutic compounds and uses thereof US Patent  US10206931 Publication Date 2/19/2019 
Target
Name:
CREB-binding protein
Synonyms:
CBP CREB-binding protein (CBP) CREBBP
Type:
Transcription Coactivator
Mol. Mass.:
265411.66
Organism:
Homo sapiens (Human)
Description:
Q92793
Residue:
2442
  
Inhibitor
Name:
BDBM349473
Synonyms:
US10206931, Example 281 | [(4R)-6-(3-
Type:
Small organic molecule
Emp. Form.:
C19H22N2O
Mol. Mass.:
294.3908
SMILES:
CC(C)c1cccc(c1)-c1cccc2NC(=O)C[C@@H](C)Nc12
: