Target
CREB-binding protein
Ligand
BDBM349502
Substrate
Meas. Tech.
CBP TR-FRET Binding Assay
IC50
15.0±n/a nM
Citation
 Romero, FAMagnuson, SRPastor, RTsui, VHMurray, JCrawford, TBurdick, DJAlbrecht, BKCote, ATaylor, AMNasveschuck, CGLeBlanc, YHewitt, MCLai, KWChen, K Therapeutic compounds and uses thereof US Patent  US10206931 Publication Date 2/19/2019 
Target
Name:
CREB-binding protein
Synonyms:
CBP CREB-binding protein (CBP) CREBBP
Type:
Transcription Coactivator
Mol. Mass.:
265411.66
Organism:
Homo sapiens (Human)
Description:
Q92793
Residue:
2442
  
Inhibitor
Name:
BDBM349502
Synonyms:
(R,S)-6-[7-(difluoromethyl)-3-methyl-6-(1-methylpyrazol-4-yl)-3,4-dihydro-2H-quinolin-1-yl]-4-methyl-1,3,4,5-tetrahydro-1,5-benzodiazepin-2-one & (R,R)-6-[7-(difluoromethyl)-3-methyl-6-(1-methylpyrazol-4-yl)-3,4-dihydro-2H-quinolin-1-yl]-4-methyl-1,3,4,5-tetrahydro-1,5-benzodiazepin-2-one | US10206931, Example 310
Type:
Small organic molecule
Emp. Form.:
C25H29F2N5O
Mol. Mass.:
453.5275
SMILES:
CN\C=C(/C=N)c1cc2C[C@@H](C)CN(c2cc1C(F)F)c1cccc2NC(=O)C[C@@H](C)Nc12
: