Target
RAC-alpha serine/threonine-protein kinase [139-480,S378A,S381A,T450D,S473D]
Ligand
BDBM15021
Substrate
biotinylated Akt peptide substrate
Meas. Tech.
Akt Kinase Assay
pH
7.5±n/a
Temperature
295.15±n/a K
IC50
690±n/a nM
Citation
 Li, QWoods, KWThomas, SZhu, GDPackard, GFisher, JLi, TGong, JDinges, JSong, XAbrams, JLuo, YJohnson, EFShi, YLiu, XKlinghofer, VDes Jong, ROltersdorf, TStoll, VSJakob, CGRosenberg, SHGiranda, VL Synthesis and structure-activity relationship of 3,4'-bispyridinylethylenes: discovery of a potent 3-isoquinolinylpyridine inhibitor of protein kinase B (PKB/Akt) for the treatment of cancer. Bioorg Med Chem Lett 16:2000-7 (2006)  
Target
Name:
RAC-alpha serine/threonine-protein kinase [139-480,S378A,S381A,T450D,S473D]
Synonyms:
AKT1 C-AKT Protein kinase B (Akt 1) RAC | RAC-PK-alpha
Type:
Enzyme
Mol. Mass.:
39513.28
Organism:
Homo sapiens (Human)
Description:
Recombinant His-tagged Akt1 (S378A, S381A, T450D, S473D; 139-480)
Residue:
342
  
Inhibitor
Name:
BDBM15021
Synonyms:
3-[(2S)-2-amino-3-phenylpropoxy]-5-[(E)-2-(pyridin-4-yl)ethenyl]pyridine trans-bispyridinylethylene analog 2g
Type:
Small organic molecule
Emp. Form.:
C21H21N3O
Mol. Mass.:
331.4109
SMILES:
N[C@H](COc1cncc(\C=C\c2ccncc2)c1)Cc1ccccc1
:
Substrate
Name:
biotinylated Akt peptide substrate
Synonyms:
Type:
Biotinylated Peptide
Mol. Mass.:
3178.04
Organism:
Description:
Km=15 uM
Residue:
28