Target
RAC-alpha serine/threonine-protein kinase [139-480,S378A,S381A,T450D,S473D]
Ligand
BDBM15050
Substrate
biotinylated Akt peptide substrate
Meas. Tech.
Akt Kinase Assay
IC50
227±n/a nM
Citation
 Li, QWoods, KWThomas, SZhu, GDPackard, GFisher, JLi, TGong, JDinges, JSong, XAbrams, JLuo, YJohnson, EFShi, YLiu, XKlinghofer, VDes Jong, ROltersdorf, TStoll, VSJakob, CGRosenberg, SHGiranda, VL Synthesis and structure-activity relationship of 3,4'-bispyridinylethylenes: discovery of a potent 3-isoquinolinylpyridine inhibitor of protein kinase B (PKB/Akt) for the treatment of cancer. Bioorg Med Chem Lett 16:2000-7 (2006)  
Target
Name:
RAC-alpha serine/threonine-protein kinase [139-480,S378A,S381A,T450D,S473D]
Synonyms:
AKT1 C-AKT Protein kinase B (Akt 1) RAC | RAC-PK-alpha
Type:
Enzyme
Mol. Mass.:
39513.28
Organism:
Homo sapiens (Human)
Description:
Recombinant His-tagged Akt1 (S378A, S381A, T450D, S473D; 139-480)
Residue:
342
  
Inhibitor
Name:
BDBM15050
Synonyms:
N-(4-{5-[(2S)-2-amino-3-(1H-indol-3-yl)propoxy]pyridin-3-yl}phenyl)acetamide | pyridine-base inhibitor 9m
Type:
Small organic molecule
Emp. Form.:
C24H24N4O2
Mol. Mass.:
400.473
SMILES:
CC(=O)Nc1ccc(cc1)-c1cncc(OC[C@@H](N)Cc2c[nH]c3ccccc23)c1
:
Substrate
Name:
biotinylated Akt peptide substrate
Synonyms:
Type:
Biotinylated Peptide
Mol. Mass.:
3178.04
Organism:
Description:
Km=15 uM
Residue:
28