Target
RAC-alpha serine/threonine-protein kinase [139-480,S378A,S381A,T450D,S473D]
Ligand
BDBM15065
Substrate
biotinylated Akt peptide substrate
Meas. Tech.
Akt Kinase Assay
IC50
270±n/a nM
Citation
 Li, QWoods, KWThomas, SZhu, GDPackard, GFisher, JLi, TGong, JDinges, JSong, XAbrams, JLuo, YJohnson, EFShi, YLiu, XKlinghofer, VDes Jong, ROltersdorf, TStoll, VSJakob, CGRosenberg, SHGiranda, VL Synthesis and structure-activity relationship of 3,4'-bispyridinylethylenes: discovery of a potent 3-isoquinolinylpyridine inhibitor of protein kinase B (PKB/Akt) for the treatment of cancer. Bioorg Med Chem Lett 16:2000-7 (2006)  
Target
Name:
RAC-alpha serine/threonine-protein kinase [139-480,S378A,S381A,T450D,S473D]
Synonyms:
AKT1 C-AKT Protein kinase B (Akt 1) RAC | RAC-PK-alpha
Type:
Enzyme
Mol. Mass.:
39513.28
Organism:
Homo sapiens (Human)
Description:
Recombinant His-tagged Akt1 (S378A, S381A, T450D, S473D; 139-480)
Residue:
342
  
Inhibitor
Name:
BDBM15065
Synonyms:
3-N-[(2S)-2-amino-3-(1H-indol-3-yl)propyl]-5-N-(isoquinolin-5-yl)pyridine-3,5-diamine | pyridine-base inhibitor 11b
Type:
Small organic molecule
Emp. Form.:
C25H24N6
Mol. Mass.:
408.4983
SMILES:
N[C@H](CNc1cncc(Nc2cccc3cnccc23)c1)Cc1c[nH]c2ccccc12
:
Substrate
Name:
biotinylated Akt peptide substrate
Synonyms:
Type:
Biotinylated Peptide
Mol. Mass.:
3178.04
Organism:
Description:
Km=15 uM
Residue:
28