Target
RAC-alpha serine/threonine-protein kinase [139-480,S378A,S381A,T450D,S473D]
Ligand
BDBM15144
Substrate
biotinylated Akt peptide substrate
Meas. Tech.
Akt Kinase Assay
pH
7.5±n/a
Temperature
295.15±n/a K
Ki
70.6±n/a nM
Citation
 Thomas, SALi, TWoods, KWSong, XPackard, GFischer, JPDiebold, RBLiu, XShi, YKlinghofer, VJohnson, EFBouska, JJOlson, AGuan, RMagnone, SRMarsh, KLuo, YRosenberg, SHGiranda, VLLi, Q Identification of a novel 3,5-disubstituted pyridine as a potent, selective, and orally active inhibitor of Akt1 kinase. Bioorg Med Chem Lett 16:3740-4 (2006)  
Target
Name:
RAC-alpha serine/threonine-protein kinase [139-480,S378A,S381A,T450D,S473D]
Synonyms:
AKT1 C-AKT Protein kinase B (Akt 1) RAC | RAC-PK-alpha
Type:
Enzyme
Mol. Mass.:
39513.28
Organism:
Homo sapiens (Human)
Description:
Recombinant His-tagged Akt1 (S378A, S381A, T450D, S473D; 139-480)
Residue:
342
  
Inhibitor
Name:
BDBM15144
Synonyms:
5-(5-{[(2S)-2-amino-5-phenylpentyl]oxy}pyridin-3-yl)-3-methyl-1H-indazole | 5-indazolyl pyridine 11m
Type:
Small organic molecule
Emp. Form.:
C24H26N4O
Mol. Mass.:
386.4894
SMILES:
Cc1n[nH]c2ccc(cc12)-c1cncc(OC[C@@H](N)CCCc2ccccc2)c1
:
Substrate
Name:
biotinylated Akt peptide substrate
Synonyms:
Type:
Biotinylated Peptide
Mol. Mass.:
3178.04
Organism:
Description:
Km=15 uM
Residue:
28