Target
Histone deacetylase 3
Ligand
BDBM347482
Substrate
IC50
145±n/a nM
Citation
 van Duzer, JHMazitschek, R Piperidine derivatives as HDAC1/2 inhibitors US Patent  US9790180 Publication Date 10/17/2017 
Target
Name:
Histone deacetylase 3
Synonyms:
HD3 HDAC3_HUMAN Human HDAC3 SMAP45
Type:
Enzyme
Mol. Mass.:
48829.55
Organism:
Homo sapiens (Human)
Description:
O15379
Residue:
428
  
Inhibitor
Name:
BDBM347482
Synonyms:
US9790180, ID 016
Type:
Small organic molecule
Emp. Form.:
C29H36N6O2S
Mol. Mass.:
532.7
SMILES:
CN1CCN(CC1)C(=O)N1CCC(C)(CC1)Nc1ccc(cc1)C(=O)Nc1cc(ccc1N)-c1cccs1
: