Target
Dihydroorotate dehydrogenase (quinone), mitochondrial [H185A]
Ligand
BDBM14710
Substrate
BDBM15346
Meas. Tech.
DHODH Inhibition Assay
IC50
570000±n/a nM
Citation
 Baldwin, JMichnoff, CHMalmquist, NAWhite, JRoth, MGRathod, PKPhillips, MA High-throughput screening for potent and selective inhibitors of Plasmodium falciparum dihydroorotate dehydrogenase. J Biol Chem 280:21847-53 (2005)  
Target
Name:
Dihydroorotate dehydrogenase (quinone), mitochondrial [H185A]
Synonyms:
DHOdehase Dihydroorotate dehydrogenase homolog | Dihydroorotate oxidase
Type:
Enzyme
Mol. Mass.:
65515.32
Organism:
Plasmodium falciparum
Description:
Q54A96[H185A]
Residue:
569
  
Inhibitor
Name:
BDBM14710
Synonyms:
ChemBridge compound no. 2 N-(4-bromo-2-methylphenyl)naphthalene-2-carboxamide | naphthamide compound 2
Type:
Small organic molecule
Emp. Form.:
C18H14BrNO
Mol. Mass.:
340.214
SMILES:
Cc1cc(Br)ccc1NC(=O)c1ccc2ccccc2c1
:
Substrate
Name:
BDBM15346
Synonyms:
2,3-dimethoxy-5-methyl-cyclohexa-2,5-diene-1,4-dione Ubiquinone-0 (CoQ0)
Type:
Small organic molecule
Emp. Form.:
C9H10O4
Mol. Mass.:
182.1733
SMILES:
COC1=C(OC)C(=O)C(C)=CC1=O
: