Target
E3 ubiquitin-protein ligase Mdm2 [17-125]
Ligand
BDBM221499
Substrate
Meas. Tech.
FRET Assay
Temperature
298.15±n/a K
IC50
0.5259±n/a nM
Comments
assayid=2 extracted
Citation
 Cammarano, CMChristopher, MPDinsmore, CDoll, RJFradera Llinas, FXLi, CMachacek, MMartinez, MNair, LGPan, WReutershan, MHShizuka, MSteinhuebel, DPSun, BThompson, CFTrotter, BWWang, YYang, LBogen, SLVoss, MEPanda, JKurissery, AT 2,6,7,8 substituted purines as HDM2 inhibitors US Patent  US9540377 Publication Date 1/10/2017 
Target
Name:
E3 ubiquitin-protein ligase Mdm2 [17-125]
Synonyms:
Double minute 2 protein MDM2 p53-binding protein Mdm2
Type:
Enzyme Catalytic Domain
Mol. Mass.:
12522.24
Organism:
Homo sapiens (Human)
Description:
Residue 17 to 125
Residue:
109
  
Inhibitor
Name:
BDBM221499
Synonyms:
6-{[(1r)-1- cyclobutylethyl]amino}- 8-[(1-pyridin-2- ylethyl)amino]-7-[4- (trifluoromethyl)benzyl]- 7h-purine-2- carboxylic acid | US9540377, 9.31
Type:
Small organic molecule
Emp. Form.:
C27H28F3N7O2
Mol. Mass.:
539.5521
SMILES:
C[C@@H](Nc1nc(nc2nc(NC(C)c3ccccn3)n(Cc3ccc(cc3)C(F)(F)F)c12)C(O)=O)C1CCC1
: