Target
Glucagon-like peptide 1 receptor
Ligand
BDBM349798
Substrate
Meas. Tech.
CHO GLP-1R Clone H6-Assay 1
EC50
140±n/a nM
Citation
 Aspnes, GEBagley, SWCurto, JMDowling, MSEdmonds, DFlanagan, MEFutatsugi, KGriffith, DAHuard, KIngle, GJiao, WLimberakis, CMathiowetz, AMPiotrowski, DWRuggeri, RB GLP-1 receptor agonists and uses thereof US Patent  US10208019 Publication Date 2/19/2019 
Target
Name:
Glucagon-like peptide 1 receptor
Synonyms:
GLP-1 receptor GLP-1R GLP1R_HUMAN Glucagon-like peptide 1 receptor (GLP-1)
Type:
Enzyme
Mol. Mass.:
53035.78
Organism:
Homo sapiens (Human)
Description:
P43220
Residue:
463
  
Inhibitor
Name:
BDBM349798
Synonyms:
2-[(4-{6-[(4-chloro-2-fluorobenzyl)oxy]pyridin-2-yl}piperidin-1-yl)methyl]-1-(1,2-oxazol-4-ylmethyl)-1H-benzimidazole-6-carboxylic acid | US10208019, Example 10A-68
Type:
Small organic molecule
Emp. Form.:
C30H27ClFN5O4
Mol. Mass.:
576.018
SMILES:
OC(=O)c1ccc2nc(CN3CCC(CC3)c3cccc(OCc4ccc(Cl)cc4F)n3)n(Cc3cnoc3)c2c1
: