Target
Mitogen-activated protein kinase 8
Ligand
BDBM15947
Substrate
biotinylated GST-ATF2
Meas. Tech.
ATF-2 Phosphorylation Assay
IC50
6300±n/a nM
Citation
 Szczepankiewicz, BGKosogof, CNelson, LTLiu, GLiu, BZhao, HSerby, MDXin, ZLiu, MGum, RJHaasch, DLWang, SClampit, JEJohnson, EFLubben, THStashko, MAOlejniczak, ETSun, CDorwin, SAHaskins, KAbad-Zapatero, CFry, EHHutchins, CWSham, HLRondinone, CMTrevillyan, JM Aminopyridine-based c-Jun N-terminal kinase inhibitors with cellular activity and minimal cross-kinase activity. J Med Chem 49:3563-80 (2006)  
Target
Name:
Mitogen-activated protein kinase 8
Synonyms:
JNK-46 JNK1-alpha-1 MK08_HUMAN PRKM8 SAPK1C c-Jun N-terminal kinase 1 c-Jun N-terminal kinase 1(JNK1) | c-Jun N-terminal kinase 2 (JNK2)
Type:
Enzyme
Mol. Mass.:
48297.57
Organism:
Homo sapiens (Human)
Description:
JNK-1 was purchased from Upstate Cell Signaling Solutions (formerly Upstate Biotechnology).
Residue:
427
  
Inhibitor
Name:
BDBM15947
Synonyms:
Aminopyridine-Based Inhibitor 28c N-(4-amino-5-cyano-6-ethoxypyridin-2-yl)-2-(butylamino)acetamide
Type:
Small organic molecule
Emp. Form.:
C14H21N5O2
Mol. Mass.:
291.3488
SMILES:
CCCCNCC(=O)Nc1cc(N)c(C#N)c(OCC)n1
:
Substrate
Name:
biotinylated GST-ATF2
Synonyms:
ATF-2-GST Activating transcription factor 2 GST-ATF2 biotinylated activating transcription factor 2
Type:
Other Protein Type
Mol. Mass.:
12237.77
Organism:
Homo sapiens (Human)
Description:
Residue:
109