Target
Mitogen-activated protein kinase 14
Ligand
BDBM16317
Substrate
myelin basic protein
Meas. Tech.
Enzyme Inhibition Assay
pH
7.4±n/a
Temperature
295.15±n/a K
Ki
0.057±n/a nM
Citation
 Liu, CWrobleski, STLin, JAhmed, GMetzger, AWityak, JGillooly, KMShuster, DJMcIntyre, KWPitt, SShen, DRZhang, RFZhang, HDoweyko, AMDiller, DHenderson, IBarrish, JCDodd, JHSchieven, GLLeftheris, K 5-Cyanopyrimidine derivatives as a novel class of potent, selective, and orally active inhibitors of p38alpha MAP kinase. J Med Chem 48:6261-70 (2005)  
Target
Name:
Mitogen-activated protein kinase 14
Synonyms:
CSAID-binding protein CSBP1 CSPB1 MAP kinase 14 MAP kinase p38 alpha MAPK14 MK14_HUMAN Mitogen-activated protein kinase p38 alpha Stress-activated protein kinase 2a | p38 MAP kinase alpha/beta
Type:
Serine/threonine-protein kinase
Mol. Mass.:
41286.76
Organism:
Homo sapiens (Human)
Description:
Q16539
Residue:
360
  
Inhibitor
Name:
BDBM16317
Synonyms:
3-({5-cyano-6-[(2,2-dimethylpropyl)(methyl)amino]-2-(4-methyl-1,4-diazepan-1-yl)pyrimidin-4-yl}amino)-N-methoxy-4-methylbenzamide | 5-Cyanopyrimidine Derivative 2
Type:
Small organic molecule
Emp. Form.:
C26H38N8O2
Mol. Mass.:
494.6323
SMILES:
CONC(=O)c1ccc(C)c(Nc2nc(nc(N(C)CC(C)(C)C)c2C#N)N2CCCN(C)CC2)c1
:
Substrate
Name:
myelin basic protein
Synonyms:
MBP Myelin A1 protein biotin-MBP protein | biotin-myelin basic protein
Type:
Other Protein Type
Mol. Mass.:
33133.33
Organism:
Homo sapiens (Human)
Description:
Residue:
304