Target
cAMP-dependent protein kinase catalytic subunit alpha
Ligand
BDBM16582
Substrate
biotinylated kemptide
Meas. Tech.
PKA/PKC Kinase Assay
IC50
>3000±n/a nM
Citation
 Zhu, GDGandhi, VBGong, JThomas, SWoods, KWSong, XLi, TDiebold, RBLuo, YLiu, XGuan, RKlinghofer, VJohnson, EFBouska, JOlson, AMarsh, KCStoll, VSMamo, MPolakowski, JCampbell, TJMartin, RLGintant, GAPenning, TDLi, QRosenberg, SHGiranda, VL Syntheses of potent, selective, and orally bioavailable indazole-pyridine series of protein kinase b/akt inhibitors with reduced hypotension. J Med Chem 50:2990-3003 (2007)  
Target
Name:
cAMP-dependent protein kinase catalytic subunit alpha
Synonyms:
KAPCA_BOVIN PKC Protein Kinase C cAMP-Dependent Protein Kinase (PKA) cAMP-dependent protein kinase A cAMP-dependent protein kinase, alpha-catalytic subunit
Type:
Enzyme Complex
Mol. Mass.:
40627.77
Organism:
Bos taurus (bovine)
Description:
The PKA holoenzyme purified from bovine heart, exists as an inactive tetrameric complex, which consists of a regulatory dimer associated with two catalytic subunits. It requires cAMP to activate the enzymatic reaction.
Residue:
351
  
Inhibitor
Name:
BDBM16582
Synonyms:
5-{5-[(2S)-2-amino-3-[3-(cyclohexylmethoxy)phenyl]propoxy]pyridin-3-yl}-3-methyl-1H-indazole | indazole-pyridine, 13au
Type:
Small organic molecule
Emp. Form.:
C29H34N4O2
Mol. Mass.:
470.6059
SMILES:
Cc1n[nH]c2ccc(cc12)-c1cncc(OC[C@@H](N)Cc2cccc(OCC3CCCCC3)c2)c1
:
Substrate
Name:
biotinylated kemptide
Synonyms:
Type:
Biotinylated Peptide
Mol. Mass.:
1353.09
Organism:
Description:
Residue:
12
ITINHLRRASLG