Target
Complement factor D
Ligand
BDBM354202
Substrate
Meas. Tech.
Factor D Assay
IC50
>10000±n/a nM
Citation
 Gadhachanda, VRWang, QPais, GHashimoto, AChen, DWang, XAgarwal, ADeshpande, MWiles, JAPhadke, AS Aryl, heteroaryl, and heterocyclic compounds for treatment of complement mediated disorders US Patent  US9796741 Publication Date 10/24/2017 
Target
Name:
Complement factor D
Synonyms:
Adipsin CFAD_HUMAN DF Properdin factor D
Type:
Protein
Mol. Mass.:
27039.19
Organism:
Homo sapiens (Human)
Description:
P00746
Residue:
253
  
Inhibitor
Name:
BDBM354202
Synonyms:
(2S,4R)-1-(2-(3-acetyl- 5-(pyridazin-4-yl)-1H- indol-1-yl)acetyl)-4- fluoro-N-(2-(pyridin-2- yl)isoindolin-4- yl)pyrrolidine-2- carboxamide US10822352, Comp No. 105 | US9796741, cmp No. 105
Type:
Small organic molecule
Emp. Form.:
C34H30FN7O3
Mol. Mass.:
603.6455
SMILES:
CC(=O)c1cn(CC(=O)N2C[C@H](F)C[C@H]2C(=O)Nc2cccc3CN(Cc23)c2ccccn2)c2ccc(cc12)-c1ccnnc1
: