Target
Beta-secretase 1
Ligand
BDBM16735
Substrate
BACE Substrate Peptide
Meas. Tech.
Bace-1 Enzymatic Assay
pH
7.5±n/a
Temperature
298.15±n/a K
IC50
46±n/a nM
Citation
 Garino, CTomita, TPietrancosta, NLaras, YRosas, RHerbette, GMaigret, BQuéléver, GIwatsubo, TKraus, JL Naphthyl and coumarinyl biarylpiperazine derivatives as highly potent human beta-secretase inhibitors. Design, synthesis, and enzymatic BACE-1 and cell assays. J Med Chem 49:4275-85 (2006)  
Target
Name:
Beta-secretase 1
Synonyms:
ASP2 Aspartyl protease 2 BACE1 Beta-secretase (BACE) Beta-secretase 1 (BACE 1) Beta-secretase 1 (BACE1) Beta-site amyloid precursor protein cleaving enzyme 1 Memapsin-2 beta-Secretase (BACE-1) | beta-Secretase (BACE1)
Type:
Protein
Mol. Mass.:
55755.10
Organism:
Homo sapiens (Human)
Description:
P56817
Residue:
501
  
Inhibitor
Name:
BDBM16735
Synonyms:
N-(2-{4-[(3R)-3-hydroxy-3-phenylpropyl]piperazin-1-yl}-5-phenylphenyl)naphthalene-1-carboxamide Naphthyl Compound, 5f
Type:
Small organic molecule
Emp. Form.:
C36H35N3O2
Mol. Mass.:
541.682
SMILES:
O[C@H](CCN1CCN(CC1)c1ccc(cc1NC(=O)c1cccc2ccccc12)-c1ccccc1)c1ccccc1
:
Substrate
Name:
BACE Substrate Peptide
Synonyms:
FRET peptide
Type:
Peptide
Mol. Mass.:
2253.39
Organism:
Description:
Residue:
18
RHEVNLDAEFKQENCHER