Target
Mitogen-activated protein kinase 14
Ligand
BDBM17083
Substrate
biotinylated GST-ATF2
Meas. Tech.
Enzyme Inhibition Scintillation Proximity Assay
pH
7±n/a
Temperature
303.15±n/a K
IC50
0.7±n/a nM
Citation
 Natarajan, SRWisnoski, DDThompson, JEO'Neill, EAO'Keefe, SJ p38 MAP kinase inhibitors. Part 3: SAR on 3,4-dihydropyrimido[4,5-d]pyrimidin-2-ones and 3,4-dihydropyrido[4,3-d]pyrimidin-2-ones. Bioorg Med Chem Lett 16:4400-4 (2006)  
Target
Name:
Mitogen-activated protein kinase 14
Synonyms:
Crk1 Csbp2 MAP kinase p38 Mapk14 Mitogen-activated protein kinase p38 alpha
Type:
Enzyme
Mol. Mass.:
41281.22
Organism:
Mus musculus (mouse)
Description:
The full-length open reading frame of murine p38 alpha was cloned and expressed in E. coli.. Soluble murine p38R was extracted from cell pellets and purified using ion-exchange chromatography.
Residue:
360
  
Inhibitor
Name:
BDBM17083
Synonyms:
5-(2-chlorophenyl)-1-(2,6-dichlorophenyl)-7-[(2,2,6,6-tetramethylpiperidin-4-yl)amino]-1H,2H,3H,4H-[1,3]diazino[4,5-d]pyrimidin-2-one | pyrimido-pyrimidine, 43
Type:
Small organic molecule
Emp. Form.:
C27H29Cl3N6O
Mol. Mass.:
559.918
SMILES:
CC1(C)CC(CC(C)(C)N1)Nc1nc2N(C(=O)NCc2c(n1)-c1ccccc1Cl)c1c(Cl)cccc1Cl
:
Substrate
Name:
biotinylated GST-ATF2
Synonyms:
ATF-2-GST Activating transcription factor 2 GST-ATF2 biotinylated activating transcription factor 2
Type:
Other Protein Type
Mol. Mass.:
12237.77
Organism:
Homo sapiens (Human)
Description:
Residue:
109