Target
Histone deacetylase 4
Ligand
BDBM228169
Substrate
Meas. Tech.
HDAC4 Biochemical
IC50
58.0±n/a nM
Citation
 Maillard, MCBreccia, PDominguez, CHaughan, AFJarvis, RELuckhurst, CASaville-Stones, EAStott, AJVan de Poël, AWall, MWishart, G Histone deacetylase inhibitors and compositions and methods of use thereof US Patent  US10047073 Publication Date 8/14/2018 
Target
Name:
Histone deacetylase 4
Synonyms:
Cereblon/Histone deacetylase 4 HDAC4 Histone acetylase 4(HDAC4) KIAA0288
Type:
Enzyme
Mol. Mass.:
119049.39
Organism:
Homo sapiens (Human)
Description:
P56524
Residue:
1084
  
Inhibitor
Name:
BDBM228169
Synonyms:
US10047073, 9
Type:
Small organic molecule
Emp. Form.:
C21H23F3N4O2
Mol. Mass.:
420.4281
SMILES:
FC(F)(F)c1nc(no1)-c1ccc(cc1)C(=O)NC1(CN2CCC3(CC3)C2)CCC1
: