Target
Histone deacetylase 4
Ligand
BDBM228172
Substrate
Meas. Tech.
HDAC4 Biochemical
IC50
230±n/a nM
Citation
 Maillard, MCBreccia, PDominguez, CHaughan, AFJarvis, RELuckhurst, CASaville-Stones, EAStott, AJVan de Poël, AWall, MWishart, G Histone deacetylase inhibitors and compositions and methods of use thereof US Patent  US10047073 Publication Date 8/14/2018 
Target
Name:
Histone deacetylase 4
Synonyms:
Cereblon/Histone deacetylase 4 HDAC4 Histone acetylase 4(HDAC4) KIAA0288
Type:
Enzyme
Mol. Mass.:
119049.39
Organism:
Homo sapiens (Human)
Description:
P56524
Residue:
1084
  
Inhibitor
Name:
BDBM228172
Synonyms:
US10047073, 11
Type:
Small organic molecule
Emp. Form.:
C19H22F3N4O2
Mol. Mass.:
395.3982
SMILES:
C[C@H]1CCC[NH+]1CC1CC1NC(=O)c1ccc(cc1)-c1noc(n1)C(F)(F)F
: