Target
Kallikrein-1
Ligand
BDBM357066
Substrate
Meas. Tech.
Kallikrein Assay
Ki
1.53±n/a nM
Citation
 Xu, JAli, AZhou, WGao, YEdmondson, SDMertz, ENeelamkavil, SFLiu, WSun, WShen, DHarper, BZhu, CBara, TLim, YYang, M Factor XIA inhibitors US Patent  US10214512 Publication Date 2/26/2019 
Target
Name:
Kallikrein-1
Synonyms:
KLK1 Kallikrein 1 Kidney/pancreas/salivary gland kallikrein | Tissue kallikrein
Type:
Enzyme
Mol. Mass.:
28874.69
Organism:
Homo sapiens (Human)
Description:
P06870
Residue:
262
  
Inhibitor
Name:
BDBM357066
Synonyms:
(S)-5-(3-chloro-2,6-difluorophenyl)-2-(24-(((2-hydroxyethoxy)carbonyl)amino)-4-oxo-3-aza-1(1,3),2(1,2) -dinenzenacyclononaphane-9-yl)pyridine 1-oxide | US10214512, Example 46
Type:
Small organic molecule
Emp. Form.:
C32H28ClF2N3O5
Mol. Mass.:
608.032
SMILES:
OCCOC(=O)Nc1ccc-2c(NC(=O)CCCC[C@@H](c3cccc-2c3)c2ccc(c[n+]2[O-])-c2c(F)ccc(Cl)c2F)c1
: