Target
Kallikrein-1
Ligand
BDBM357188
Substrate
Meas. Tech.
Kallikrein Assay
Ki
0.400±n/a nM
Citation
 Xu, JAli, AZhou, WGao, YEdmondson, SDMertz, ENeelamkavil, SFLiu, WSun, WShen, DHarper, BZhu, CBara, TLim, YYang, M Factor XIA inhibitors US Patent  US10214512 Publication Date 2/26/2019 
Target
Name:
Kallikrein-1
Synonyms:
KLK1 Kallikrein 1 Kidney/pancreas/salivary gland kallikrein | Tissue kallikrein
Type:
Enzyme
Mol. Mass.:
28874.69
Organism:
Homo sapiens (Human)
Description:
P06870
Residue:
262
  
Inhibitor
Name:
BDBM357188
Synonyms:
US10214512, Example 143-b
Type:
Small organic molecule
Emp. Form.:
C30H29F2N5O4
Mol. Mass.:
561.5792
SMILES:
COC(=O)Nc1ccc2-c3nc([nH]c3C)[C@H](CCC[C@@H](C)C(=O)Nc2c1)c1ccc(c[n+]1[O-])-c1c(F)cccc1F
: