Target
Nuclear receptor ROR-gamma
Ligand
BDBM359585
Substrate
Meas. Tech.
Biological Assay
IC50
1.10±n/a nM
Citation
 Lapointe, BTFuller, PHGunaydin, HLiu, KSciammetta, NTrotter, BWZhang, HBarr, KJMaclean, JKMolinari, DFSimov, V Substituted pyrazole compounds as RORgammaT inhibitors and uses thereof US Patent  US10221142 Publication Date 3/5/2019 
Target
Name:
Nuclear receptor ROR-gamma
Synonyms:
NR1F3 Nuclear receptor ROR-gamma (RORC) RAR-related orphan receptor C (RORc) RORG RZRG Retinoid-related orphan receptor-gamma (RORc)
Type:
Enzyme Catalytic Domain
Mol. Mass.:
58218.40
Organism:
Homo sapiens (Human)
Description:
P51449
Residue:
518
  
Inhibitor
Name:
BDBM359585
Synonyms:
(R or S)-4-(1-(2- chloro-6-(1- (trifluoromethyl)cyclo- propyl)benzoyl)-6- (3- (dimethylamino)azeti dine-1-carbonyl)- 4,5,6,7-tetrahydro- 1H-indazol-3-yl)-3- fluorobenzoic acid | US10221142, Example 21ZZ
Type:
Small organic molecule
Emp. Form.:
C31H29ClF4N4O4
Mol. Mass.:
633.033
SMILES:
CN(C)C1CN(C1)C(=O)C1CCc2c(C1)n(nc2-c1ccc(cc1F)C(O)=O)C(=O)c1c(Cl)cccc1C1(CC1)C(F)(F)F
: