Target
Nuclear receptor ROR-gamma
Ligand
BDBM359592
Substrate
Meas. Tech.
Biological Assay
IC50
13.0±n/a nM
Citation
 Lapointe, BTFuller, PHGunaydin, HLiu, KSciammetta, NTrotter, BWZhang, HBarr, KJMaclean, JKMolinari, DFSimov, V Substituted pyrazole compounds as RORgammaT inhibitors and uses thereof US Patent  US10221142 Publication Date 3/5/2019 
Target
Name:
Nuclear receptor ROR-gamma
Synonyms:
NR1F3 Nuclear receptor ROR-gamma (RORC) RAR-related orphan receptor C (RORc) RORG RZRG Retinoid-related orphan receptor-gamma (RORc)
Type:
Enzyme Catalytic Domain
Mol. Mass.:
58218.40
Organism:
Homo sapiens (Human)
Description:
P51449
Residue:
518
  
Inhibitor
Name:
BDBM359592
Synonyms:
US10221142, Example 25A
Type:
Small organic molecule
Emp. Form.:
C23H19ClFN3O3
Mol. Mass.:
439.867
SMILES:
OC(=O)c1ccc(-c2nn(C(=O)c3c(Cl)cccc3C3CC3)c3CCCNc23)c(F)c1
: