Target
Thymidylate synthase
Ligand
BDBM18761
Substrate
BDBM18754
Meas. Tech.
Thymidylate Synthase (TS) Assay
Ki
3500±n/a nM
Citation
 Costi, MPGelain, ABarlocco, DGhelli, SSoragni, FReniero, FRossi, TRuberto, AGuillou, CCavazzuti, ACasolari, CFerrari, S Antibacterial agent discovery using thymidylate synthase biolibrary screening. J Med Chem 49:5958-68 (2006)  
Target
Name:
Thymidylate synthase
Synonyms:
TMP1 TYSY_CRYNB | Thymidylate Synthase (TS)
Type:
Enzyme
Mol. Mass.:
35863.57
Organism:
Cryptococcus neoformans
Description:
Residue:
317
  
Inhibitor
Name:
BDBM18761
Synonyms:
1,2-naphthalein derivative, 8 | 5,5-bis(3-fluoro-4-hydroxyphenyl)-4-oxatricyclo[7.4.0.0^{2,6}]trideca-1(9),2(6),7,10,12-pentaen-3-one
Type:
Small organic molecule
Emp. Form.:
C24H14F2O4
Mol. Mass.:
404.3624
SMILES:
Oc1ccc(cc1F)C1(OC(=O)c2c1ccc1ccccc21)c1ccc(O)c(F)c1
:
Substrate
Name:
BDBM18754
Synonyms:
(2S)-2-[(4-{11-amino-13-oxo-2,4,8,10,12-pentaazatricyclo[7.4.0.0^{2,6}]trideca-1(9),11-dien-4-yl}phenyl)formamido]pentanedioate 5,10-Methylenetetrahydrofolate
Type:
Small organic molecule
Emp. Form.:
C20H21N7O6
Mol. Mass.:
455.4251
SMILES:
Nc1nc2NCC3CN(CN3c2c(=O)[nH]1)c1ccc(cc1)C(=O)N[C@@H](CCC([O-])=O)C([O-])=O
: