Target
Coagulation factor XI
Ligand
BDBM246182
Substrate
Meas. Tech.
Inhibition Assay
IC50
2.80±n/a nM
Citation
 Röhrig, SHillisch, AStrassburger, JHeitmeier, SSchmidt, MVSchlemmer, KTersteegen, ABuchmüller, AGerdes, CSchäfer, MKinzel, TTeller, HSchirok, HKlar, JNunez, EJ Substituted oxopyridine derivatives and use thereof in the treatment of cardiovascular disorders US Patent  US9822102 Publication Date 11/21/2017 
Target
Name:
Coagulation factor XI
Synonyms:
Coagulation factor XIa Coagulation factor XIa light chain FA11_HUMAN Factor XIa PTA | Plasma thromboplastin antecedent
Type:
Enzyme
Mol. Mass.:
70130.58
Organism:
Homo sapiens (Human)
Description:
P03951
Residue:
625
  
Inhibitor
Name:
BDBM246182
Synonyms:
US10183932, Example 89 US9434690, 88 US9822102, Example 89
Type:
Small organic molecule
Emp. Form.:
C27H24ClN3O6
Mol. Mass.:
521.949
SMILES:
COc1cn(C(C[C@@H]2CCCO2)C(=O)Nc2ccc(cc2)C(O)=O)c(=O)cc1-c1cc(Cl)ccc1C#N
: