Target
Plasma kallikrein
Ligand
BDBM246262
Substrate
Meas. Tech.
Enzymatic Activity Assay
IC50
3.10±n/a nM
Citation
 Röhrig, SHillisch, AStrassburger, JHeitmeier, SSchmidt, MVSchlemmer, KTersteegen, ABuchmüller, AGerdes, CSchäfer, MKinzel, TTeller, HSchirok, HKlar, JNunez, EJ Substituted oxopyridine derivatives and use thereof in the treatment of cardiovascular disorders US Patent  US9822102 Publication Date 11/21/2017 
Target
Name:
Plasma kallikrein
Synonyms:
Fletcher factor KLKB1 Kallikrein Plasma kallikrein heavy chain Plasma prekallikrein
Type:
Protein
Mol. Mass.:
71391.16
Organism:
Homo sapiens (Human)
Description:
P03952
Residue:
638
  
Inhibitor
Name:
BDBM246262
Synonyms:
US10183932, Example 168 US9822102, Example 168
Type:
Small organic molecule
Emp. Form.:
C27H23ClN4O6
Mol. Mass.:
534.948
SMILES:
COCCC(C(=O)Nc1ccc2cc([nH]c2c1)C(O)=O)n1cc(OC)c(cc1=O)-c1cc(Cl)ccc1C#N
: