Target
Envelope glycoprotein gp160
Ligand
BDBM235034
Substrate
Meas. Tech.
HIV cell culture assay
EC50
80.0±n/a nM
Citation
 Chen, JChen, YMeanwell, NARegueiro-Ren, ASin, NSit, S C17-aryl substituted betulinic acid analogs US Patent  US10047118 Publication Date 8/14/2018 
Target
Name:
Envelope glycoprotein gp160
Synonyms:
ENV_HV1H2 Envelope surface glycoprotein gp160, precursor env
Type:
Mol. Mass.:
97241.93
Organism:
Human immunodeficiency virus type 1 group M subtype B (isolate HXB2)
Description:
Residue:
856
  
Inhibitor
Name:
BDBM235034
Synonyms:
2-(((1R,3aS,5aR,5bR,7aR,11aS,11bR,13aR,13bR)-9-(4-carboxyphenyl)-5a,5b,8,8,11a-pentamethyl-1-(prop-1-en-2-yl)-2,3,3a,4,5,5a,5b,6,7,7a,8,11,11a,11b,12,13,13a,13b-octadecahydro-1H-cyclopenta[a]chrysen-3a-yl)ethynyl)benzoic acid | US10047118, 1
Type:
Small organic molecule
Emp. Form.:
C45H54O4
Mol. Mass.:
658.9079
SMILES:
CC(=C)[C@@H]1CC[C@@]2(CC[C@]3(C)[C@H](CC[C@@H]4[C@@]5(C)CC=C(c6ccc(cc6)C(O)=O)C(C)(C)[C@@H]5CC[C@@]34C)[C@@H]12)C#Cc1ccccc1C(O)=O
: