Target
Orexin receptor type 2
Ligand
BDBM360365
Substrate
Meas. Tech.
FLIPR Ca2+ Flux Assay
IC50
42.0±n/a nM
Citation
 Liverton, NBeshore, DCKuduk, SDLuo, YMeng, NYu, T Oxazole orexin receptor antagonists US Patent  US9828368 Publication Date 11/28/2017 
Target
Name:
Orexin receptor type 2
Synonyms:
HCRTR2 OX2R_HUMAN Orexin receptor type 2 (OR-2) Orexin receptor type 2 (OX2R) Ox-2-R | Ox2-R
Type:
Protein
Mol. Mass.:
50710.53
Organism:
Homo sapiens (Human)
Description:
O43614
Residue:
444
  
Inhibitor
Name:
BDBM360365
Synonyms:
((2R, 5R)-5-(4-(2-Hydroxypropan-2- yl)-5-methyloxazol-2-yl)-2- methylpiperidin-1-yl)(2-(pyrimidin-2- yl)thiophen-3-yl)methanone | US9828368, Example 26
Type:
Small organic molecule
Emp. Form.:
C22H26N4O3S
Mol. Mass.:
426.532
SMILES:
C[C@@H]1CC[C@H](CN1C(=O)c1ccsc1-c1ncccn1)c1nc(c(C)o1)C(C)(C)O
: