Target
Orexin/Hypocretin receptor type 1
Ligand
BDBM360376
Substrate
IC50
2940±n/a nM
Citation
 Liverton, NBeshore, DCKuduk, SDLuo, YMeng, NYu, T Oxazole orexin receptor antagonists US Patent  US9828368 Publication Date 11/28/2017 
Target
Name:
Orexin/Hypocretin receptor type 1
Synonyms:
Hcrtr1 OX1R_RAT Orexin receptor type 1 (OX1R) Ox1-R | Ox1R
Type:
Protein
Mol. Mass.:
46817.55
Organism:
Rattus norvegicus (Rat)
Description:
P56718
Residue:
416
  
Inhibitor
Name:
BDBM360376
Synonyms:
US9828368, Example 35
Type:
Small organic molecule
Emp. Form.:
C20H25N5O3S
Mol. Mass.:
415.509
SMILES:
C[C@@H]1CC[C@H](CN1C(=O)c1cscc1-n1nccn1)c1nc(c(C)o1)C(C)(C)O
: