Target
E3 ubiquitin-protein ligase XIAP [124-240]
Ligand
BDBM239313
Substrate
Meas. Tech.
TR-FRET Assay for BIR2 and BIR3
pH
7.5±n/a
Temperature
298.15±n/a K
IC50
38.0±n/a nM
Comments
extracted
Citation
 Chen, SDonnell, AFKester, RFLe, KLou, YMichoud, CRemiszewski, SRupert, KCWeisel, M Tetrahydro-benzodiazepinones US Patent  US10053431 Publication Date 8/21/2018 
Target
Name:
E3 ubiquitin-protein ligase XIAP [124-240]
Synonyms:
6x Histidine-tagged BIR2 domain BIR2 (aa 124-240) E3 ubiquitin-protein ligase (XIAP-BIR2)(C202A/C213G) XIAP XIAP_HUMAN | amino acids 124-240 of XIAP
Type:
Enzyme Catalytic Domain
Mol. Mass.:
13562.46
Organism:
Homo sapiens (Human)
Description:
P98170[124-240]
Residue:
117
  
Inhibitor
Name:
BDBM239313
Synonyms:
US10053431, 96j | US10053431, 96k
Type:
Small organic molecule
Emp. Form.:
C32H33N5O3
Mol. Mass.:
535.6361
SMILES:
CN[C@@H](C)C(=O)N[C@H]1CN(C(=O)c2cccc(N)c2)c2ccccc2N(Cc2c(C)ccc3ccccc23)C1=O
: