Target
E3 ubiquitin-protein ligase XIAP [124-240]
Ligand
BDBM50441818
Substrate
Meas. Tech.
TR-FRET Assay for BIR2 and BIR3
pH
7.5±n/a
Temperature
298.15±n/a K
IC50
6.00±n/a nM
Comments
extracted
Citation
 Chen, SDonnell, AFKester, RFLe, KLou, YMichoud, CRemiszewski, SRupert, KCWeisel, M Tetrahydro-benzodiazepinones US Patent  US10053431 Publication Date 8/21/2018 
Target
Name:
E3 ubiquitin-protein ligase XIAP [124-240]
Synonyms:
6x Histidine-tagged BIR2 domain BIR2 (aa 124-240) E3 ubiquitin-protein ligase (XIAP-BIR2)(C202A/C213G) XIAP XIAP_HUMAN | amino acids 124-240 of XIAP
Type:
Enzyme Catalytic Domain
Mol. Mass.:
13562.46
Organism:
Homo sapiens (Human)
Description:
P98170[124-240]
Residue:
117
  
Inhibitor
Name:
BDBM50441818
Synonyms:
CHEMBL2436213 | US10053431, 75d
Type:
Small organic molecule
Emp. Form.:
C31H35BrN4O5
Mol. Mass.:
623.537
SMILES:
CN[C@@H](C)C(=O)N[C@H]1CN(C(=O)C2CCOCC2)c2ccccc2N(Cc2c(OC)ccc3cc(Br)ccc23)C1=O
: