Target
E3 ubiquitin-protein ligase XIAP [241-356]
Ligand
BDBM243185
Substrate
Meas. Tech.
TR-FRET Assay for BIR2 and BIR3
pH
7.5±n/a
Temperature
298.15±n/a K
IC50
24770±n/a nM
Comments
extracted
Citation
 Chen, SDonnell, AFKester, RFLe, KLou, YMichoud, CRemiszewski, SRupert, KCWeisel, M Tetrahydro-benzodiazepinones US Patent  US10053431 Publication Date 8/21/2018 
Target
Name:
E3 ubiquitin-protein ligase XIAP [241-356]
Synonyms:
API3 BIR3 domain IAP3 XIAP Bir3 amino acids 241-356 of XIAP
Type:
Enzyme Catalytic Domain
Mol. Mass.:
14548.06
Organism:
Homo sapiens (Human)
Description:
P98170[241-356]
Residue:
125
  
Inhibitor
Name:
BDBM243185
Synonyms:
US10053431, 89d
Type:
Small organic molecule
Emp. Form.:
C32H31BrClN5O4
Mol. Mass.:
664.977
SMILES:
CN[C@@H](C)C(=O)N[C@H]1CN(C(=O)Cc2ccc(Cl)nc2)c2ccccc2N(Cc2c(OC)ccc3cc(Br)ccc23)C1=O
: