Target
Complement factor D
Ligand
BDBM360793
Substrate
Meas. Tech.
Inhibition Assay
IC50
<1000±n/a nM
Citation
 Wiles, JAPais, GHashimoto, AGadhachanda, VRWang, QChen, DWang, XAgarwal, ADeshpande, MPhadke, AS Alkyne compounds for treatment of complement mediated disorders US Patent  US9828396 Publication Date 11/28/2017 
Target
Name:
Complement factor D
Synonyms:
Adipsin CFAD_HUMAN DF Properdin factor D
Type:
Protein
Mol. Mass.:
27039.19
Organism:
Homo sapiens (Human)
Description:
P00746
Residue:
253
  
Inhibitor
Name:
BDBM360793
Synonyms:
(2S,4R)-1-(2-(3-acetyl-5- (pyrimidin-2-ylethynyl)-1H- indol-1-yl)acetyl)-N-(6- bromopyridin-2-yl)-4- fluoropyrrolidine-2- carboxamide | US9828396, Compound 42
Type:
Small organic molecule
Emp. Form.:
C28H22BrFN6O3
Mol. Mass.:
589.415
SMILES:
CC(=O)c1cn(CC(=O)N2C[C@H](F)C[C@H]2C(=O)Nc2cccc(Br)n2)c2ccc(cc12)C#Cc1ncccn1
: