Target
Metallo-beta-lactamase type 2
Ligand
BDBM360913
Substrate
Meas. Tech.
BIOLOGICAL ASSAYS
IC50
0.032±n/a nM
Citation
 Bennett, FJiang, JPasternak, ADong, SGu, XScott, JDTang, HZhao, ZHuang, YYang, DYoung, KXiao, LZhang, ZFu, J Metallo-beta-lactamase inhibitors US Patent  US10221163 Publication Date 3/5/2019 
Target
Name:
Metallo-beta-lactamase type 2
Synonyms:
B2 metallo-beta-lactamase Beta-lactamase NDM-1 Metallo-beta-lactamase NDM-1 Metallo-beta-lactamase type II New Delhi metallo-beta-lactamase-1 | blaNDM-1
Type:
PROTEIN
Mol. Mass.:
28498.15
Organism:
Klebsiella pneumoniae
Description:
ChEMBL_103887
Residue:
270
  
Inhibitor
Name:
BDBM360913
Synonyms:
4-(2-amino-1,3- benzothiazol-4-yl)-N1- [(3R)-piperidin-3-yl]-3- (1H-tetrazol-5-yl)benzene- 1,2-disulfonamide US10544130, Example 69
Type:
Small organic molecule
Emp. Form.:
C19H21N9O4S3
Mol. Mass.:
535.623
SMILES:
Nc1nc2c(cccc2s1)-c1ccc(c(c1-c1nnn[nH]1)S(N)(=O)=O)S(=O)(=O)N[C@@H]1CCCNC1
: