Target
Metallo-beta-lactamase type 2
Ligand
BDBM360962
Substrate
Meas. Tech.
BIOLOGICAL ASSAYS
IC50
0.026±n/a nM
Citation
 Bennett, FJiang, JPasternak, ADong, SGu, XScott, JDTang, HZhao, ZHuang, YYang, DYoung, KXiao, LZhang, ZFu, J Metallo-beta-lactamase inhibitors US Patent  US10221163 Publication Date 3/5/2019 
Target
Name:
Metallo-beta-lactamase type 2
Synonyms:
B2 metallo-beta-lactamase Beta-lactamase NDM-1 Metallo-beta-lactamase NDM-1 Metallo-beta-lactamase type II New Delhi metallo-beta-lactamase-1 | blaNDM-1
Type:
PROTEIN
Mol. Mass.:
28498.15
Organism:
Klebsiella pneumoniae
Description:
ChEMBL_103887
Residue:
270
  
Inhibitor
Name:
BDBM360962
Synonyms:
3-(4-(2-aminobenzo [d]thiazol-4-yl)-2- sulfamoyl-3-(1H- tetrazol-5-yl)phenyl- sulfonamido)-1,1- difluoropropan-2- aminium formate US10544130, Example 118
Type:
Small organic molecule
Emp. Form.:
C17H17F2N9O4S3
Mol. Mass.:
545.567
SMILES:
NC(CNS(=O)(=O)c1ccc(-c2cccc3sc(N)nc23)c(-c2nnn[nH]2)c1S(N)(=O)=O)C(F)F
: