Target
Phosphatidylinositol 4,5-bisphosphate 3-kinase catalytic subunit delta isoform
Ligand
BDBM361902
Substrate
Meas. Tech.
HTRF PI3K Biochemical Assay
IC50
4.00±n/a nM
Citation
 McGowan, MAZhou, HKatz, JDYang, LMethot, JLLipford, KAXu, SFu, NXu, GBian, DFu, JLi, YFong, KC Purine inhibitors of human phosphatidylinositol 3-kinase delta US Patent  US10221178 Publication Date 3/5/2019 
Target
Name:
Phosphatidylinositol 4,5-bisphosphate 3-kinase catalytic subunit delta isoform
Synonyms:
PI3-kinase p110 subunit delta PI3-kinase subunit p110-delta PIK3CD Phosphatidylinositol 4,5-biphosphate 3-kinase catalytic subunit delta (PIK3CD) Phosphatidylinositol 4,5-bisphosphate 3-kinase 110 kDa catalytic subunit delta (PI3K delta) Phosphatidylinositol 4,5-bisphosphate 3-kinase catalytic subunit delta (PI3Kdelta) Phosphatidylinositol 4,5-bisphosphate 3-kinase catalytic subunit delta isoform (PI3K delta) Phosphatidylinositol 4,5-bisphosphate 3-kinase catalytic subunit delta isoform (PI3K-delta) Phosphatidylinositol 4,5-bisphosphate 3-kinase catalytic subunit delta isoform (PI3Kdelta)
Type:
Enzyme Subunit
Mol. Mass.:
119489.41
Organism:
Homo sapiens (Human)
Description:
O00329
Residue:
1044
  
Inhibitor
Name:
BDBM361902
Synonyms:
(R and S)-N-(1-{[(cis)-2,6- dimethylmorpholin-4- yl]carbonyl}propyl)-8-(1-ethyl- 5-methyl-1H-pyrazol-4-yl)-9- methyl-9H-purin-6-amine | US10221178, Compound 1-4
Type:
Small organic molecule
Emp. Form.:
C22H32N8O2
Mol. Mass.:
440.5419
SMILES:
CCC(Nc1ncnc2n(C)c(nc12)-c1cnn(CC)c1C)C(=O)N1C[C@H](C)O[C@H](C)C1
: